VectorXYZT from VectorXYZ and double

Name Stage Failure
failed
compile Build
make[2]: *** [CMakeFiles/eicd.dir/build.make:181: eicd.cxx] Error 1
make[1]: *** [CMakeFiles/Makefile2:128: CMakeFiles/eicd.dir/all] Error 2
make: *** [Makefile:136: all] Error 2
Uploading artifacts for failed job
Uploading artifacts...
WARNING: juggler.env: no matching files
ERROR: No files to upload
Cleaning up project directory and file based variables
ERROR: Job failed: exit code 2