Updated DD4hep

2 jobs for master in 2 minutes and 59 seconds (queued for 1 second)
Status Job ID Name Coverage
  Build
failed #176
build_latest

00:02:54

 
  Build Cleanup
passed #177
cleanup_docker

00:00:05

 
Name Stage Failure
failed
build_latest Build
make[2]: *** [DDCore/CMakeFiles/DDCore.dir/build.make:193: DDCore/CMakeFiles/DDCore.dir/src/AlignmentData.cpp.o] Error 1
make[2]: *** [DDCore/CMakeFiles/DDCore.dir/build.make:337: DDCore/CMakeFiles/DDCore.dir/src/AlignmentsPrinter.cpp.o] Error 1
make[2]: *** [DDCore/CMakeFiles/DDCore.dir/build.make:673: DDCore/CMakeFiles/DDCore.dir/src/ConditionsInterna.cpp.o] Error 1
make[2]: *** [DDCore/CMakeFiles/DDCore.dir/build.make:289: DDCore/CMakeFiles/DDCore.dir/src/AlignmentsCalculator.cpp.o] Error 1
make[2]: *** [DDCore/CMakeFiles/DDCore.dir/build.make:361: DDCore/CMakeFiles/DDCore.dir/src/AlignmentsProcessor.cpp.o] Error 1
make[1]: *** [CMakeFiles/Makefile2:1209: DDCore/CMakeFiles/DDCore.dir/all] Error 2
make: *** [Makefile:139: all] Error 2
The command '/bin/sh -c git clone $DD4HEP_REPO && cd DD4hep && git checkout $DD4HEP_CHECKOUT && cd .. && mkdir build && cd build && cmake -DBUILD_TESTING=ON -DCMAKE_INSTALL_PREFIX=/usr/local -DDD4HEP_USE_CXX14=ON -DDD4HEP_USE_GEANT4=ON -DDD4HEP_USE_LCIO=ON -DDD4HEP_USE_PYROOT=ON -DDD4HEP_USE_XERCESC=ON ../DD4hep && make -j $BUILD_THREADS && sudo make install && cd .. && rm -rf build DD4hep' returned a non-zero code: 2
ERROR: Job failed: exit status 1